springboot整合websocket后打包报错:javax.websocket.server.ServerContainer not available

Easter79
• 阅读 442

  项目整合了websocket以后,打包多次都没有成功,原来是报错了,报错内容如下:

springboot整合websocket后打包报错:javax.websocket.server.ServerContainer not available springboot整合websocket后打包报错:javax.websocket.server.ServerContainer not available

Error starting ApplicationContext. To display the conditions report re-run your application with 'debug' enabled.
org.springframework.boot.SpringApplication.reportFailure(SpringApplication.java:837) 2020-03-18 08:20:02,192 [main] ERROR pringApplication - Application run failed
org.springframework.beans.factory.BeanCreationException: Error creating bean with name 'serverEndpointExporter' defined in class path resource [com/winmine/server/config/WebSocketConfig.class]: Invocation of init method failed; nested exception is java.lang.IllegalStateException: javax.websocket.server.ServerContainer not available
    at org.springframework.beans.factory.support.AbstractAutowireCapableBeanFactory.initializeBean(AbstractAutowireCapableBeanFactory.java:1694)
    at org.springframework.beans.factory.support.AbstractAutowireCapableBeanFactory.doCreateBean(AbstractAutowireCapableBeanFactory.java:573)
    at org.springframework.beans.factory.support.AbstractAutowireCapableBeanFactory.createBean(AbstractAutowireCapableBeanFactory.java:495)
    at org.springframework.beans.factory.support.AbstractBeanFactory.lambda$doGetBean$0(AbstractBeanFactory.java:317)
    at org.springframework.beans.factory.support.DefaultSingletonBeanRegistry.getSingleton(DefaultSingletonBeanRegistry.java:222)
    at org.springframework.beans.factory.support.AbstractBeanFactory.doGetBean(AbstractBeanFactory.java:315)
    at org.springframework.beans.factory.support.AbstractBeanFactory.getBean(AbstractBeanFactory.java:199)
    at org.springframework.beans.factory.support.DefaultListableBeanFactory.preInstantiateSingletons(DefaultListableBeanFactory.java:759)
    at org.springframework.context.support.AbstractApplicationContext.finishBeanFactoryInitialization(AbstractApplicationContext.java:867)
    at org.springframework.context.support.AbstractApplicationContext.refresh(AbstractApplicationContext.java:548)
    at org.springframework.boot.SpringApplication.refresh(SpringApplication.java:754)
    at org.springframework.boot.SpringApplication.refreshContext(SpringApplication.java:386)
    at org.springframework.boot.SpringApplication.run(SpringApplication.java:307)
    at org.springframework.boot.test.context.SpringBootContextLoader.loadContext(SpringBootContextLoader.java:127)
    at org.springframework.test.context.cache.DefaultCacheAwareContextLoaderDelegate.loadContextInternal(DefaultCacheAwareContextLoaderDelegate.java:99)
    at org.springframework.test.context.cache.DefaultCacheAwareContextLoaderDelegate.loadContext(DefaultCacheAwareContextLoaderDelegate.java:117)
    at org.springframework.test.context.support.DefaultTestContext.getApplicationContext(DefaultTestContext.java:108)
    at org.springframework.test.context.web.ServletTestExecutionListener.setUpRequestContextIfNecessary(ServletTestExecutionListener.java:190)
    at org.springframework.test.context.web.ServletTestExecutionListener.prepareTestInstance(ServletTestExecutionListener.java:132)
    at org.springframework.test.context.TestContextManager.prepareTestInstance(TestContextManager.java:246)
    at org.springframework.test.context.junit4.SpringJUnit4ClassRunner.createTest(SpringJUnit4ClassRunner.java:227)
    at org.springframework.test.context.junit4.SpringJUnit4ClassRunner$1.runReflectiveCall(SpringJUnit4ClassRunner.java:289)
    at org.junit.internal.runners.model.ReflectiveCallable.run(ReflectiveCallable.java:12)
    at org.springframework.test.context.junit4.SpringJUnit4ClassRunner.methodBlock(SpringJUnit4ClassRunner.java:291)
    at org.springframework.test.context.junit4.SpringJUnit4ClassRunner.runChild(SpringJUnit4ClassRunner.java:246)
    at org.springframework.test.context.junit4.SpringJUnit4ClassRunner.runChild(SpringJUnit4ClassRunner.java:97)
    at org.junit.runners.ParentRunner$3.run(ParentRunner.java:290)
    at org.junit.runners.ParentRunner$1.schedule(ParentRunner.java:71)
    at org.junit.runners.ParentRunner.runChildren(ParentRunner.java:288)
    at org.junit.runners.ParentRunner.access$000(ParentRunner.java:58)
    at org.junit.runners.ParentRunner$2.evaluate(ParentRunner.java:268)
    at org.springframework.test.context.junit4.statements.RunBeforeTestClassCallbacks.evaluate(RunBeforeTestClassCallbacks.java:61)
    at org.springframework.test.context.junit4.statements.RunAfterTestClassCallbacks.evaluate(RunAfterTestClassCallbacks.java:70)
    at org.junit.runners.ParentRunner.run(ParentRunner.java:363)
    at org.springframework.test.context.junit4.SpringJUnit4ClassRunner.run(SpringJUnit4ClassRunner.java:190)
    at org.apache.maven.surefire.junit4.JUnit4Provider.execute(JUnit4Provider.java:365)
    at org.apache.maven.surefire.junit4.JUnit4Provider.executeWithRerun(JUnit4Provider.java:273)
    at org.apache.maven.surefire.junit4.JUnit4Provider.executeTestSet(JUnit4Provider.java:238)
    at org.apache.maven.surefire.junit4.JUnit4Provider.invoke(JUnit4Provider.java:159)
    at org.apache.maven.surefire.booter.ForkedBooter.invokeProviderInSameClassLoader(ForkedBooter.java:379)
    at org.apache.maven.surefire.booter.ForkedBooter.runSuitesInProcess(ForkedBooter.java:340)
    at org.apache.maven.surefire.booter.ForkedBooter.execute(ForkedBooter.java:125)
    at org.apache.maven.surefire.booter.ForkedBooter.main(ForkedBooter.java:413)
Caused by: java.lang.IllegalStateException: javax.websocket.server.ServerContainer not available
    at org.springframework.util.Assert.state(Assert.java:73)
    at org.springframework.web.socket.server.standard.ServerEndpointExporter.afterPropertiesSet(ServerEndpointExporter.java:107)
    at org.springframework.beans.factory.support.AbstractAutowireCapableBeanFactory.invokeInitMethods(AbstractAutowireCapableBeanFactory.java:1753)
    at org.springframework.beans.factory.support.AbstractAutowireCapableBeanFactory.initializeBean(AbstractAutowireCapableBeanFactory.java:1690)
    ... 42 more
org.springframework.test.context.TestContextManager.prepareTestInstance(TestContextManager.java:250) 2020-03-18 08:20:02,195 [main] ERROR stContextManager - Caught exception while allowing TestExecutionListener [org.springframework.test.context.web.ServletTestExecutionListener@1725dc0f] to prepare test instance [com.example.demo.DemoApplicationTests@497b560e]
java.lang.IllegalStateException: Failed to load ApplicationContext
    at org.springframework.test.context.cache.DefaultCacheAwareContextLoaderDelegate.loadContext(DefaultCacheAwareContextLoaderDelegate.java:125)
    at org.springframework.test.context.support.DefaultTestContext.getApplicationContext(DefaultTestContext.java:108)
    at org.springframework.test.context.web.ServletTestExecutionListener.setUpRequestContextIfNecessary(ServletTestExecutionListener.java:190)
    at org.springframework.test.context.web.ServletTestExecutionListener.prepareTestInstance(ServletTestExecutionListener.java:132)
    at org.springframework.test.context.TestContextManager.prepareTestInstance(TestContextManager.java:246)
    at org.springframework.test.context.junit4.SpringJUnit4ClassRunner.createTest(SpringJUnit4ClassRunner.java:227)
    at org.springframework.test.context.junit4.SpringJUnit4ClassRunner$1.runReflectiveCall(SpringJUnit4ClassRunner.java:289)
    at org.junit.internal.runners.model.ReflectiveCallable.run(ReflectiveCallable.java:12)
    at org.springframework.test.context.junit4.SpringJUnit4ClassRunner.methodBlock(SpringJUnit4ClassRunner.java:291)
    at org.springframework.test.context.junit4.SpringJUnit4ClassRunner.runChild(SpringJUnit4ClassRunner.java:246)
    at org.springframework.test.context.junit4.SpringJUnit4ClassRunner.runChild(SpringJUnit4ClassRunner.java:97)
    at org.junit.runners.ParentRunner$3.run(ParentRunner.java:290)
    at org.junit.runners.ParentRunner$1.schedule(ParentRunner.java:71)
    at org.junit.runners.ParentRunner.runChildren(ParentRunner.java:288)
    at org.junit.runners.ParentRunner.access$000(ParentRunner.java:58)
    at org.junit.runners.ParentRunner$2.evaluate(ParentRunner.java:268)
    at org.springframework.test.context.junit4.statements.RunBeforeTestClassCallbacks.evaluate(RunBeforeTestClassCallbacks.java:61)
    at org.springframework.test.context.junit4.statements.RunAfterTestClassCallbacks.evaluate(RunAfterTestClassCallbacks.java:70)
    at org.junit.runners.ParentRunner.run(ParentRunner.java:363)
    at org.springframework.test.context.junit4.SpringJUnit4ClassRunner.run(SpringJUnit4ClassRunner.java:190)
    at org.apache.maven.surefire.junit4.JUnit4Provider.execute(JUnit4Provider.java:365)
    at org.apache.maven.surefire.junit4.JUnit4Provider.executeWithRerun(JUnit4Provider.java:273)
    at org.apache.maven.surefire.junit4.JUnit4Provider.executeTestSet(JUnit4Provider.java:238)
    at org.apache.maven.surefire.junit4.JUnit4Provider.invoke(JUnit4Provider.java:159)
    at org.apache.maven.surefire.booter.ForkedBooter.invokeProviderInSameClassLoader(ForkedBooter.java:379)
    at org.apache.maven.surefire.booter.ForkedBooter.runSuitesInProcess(ForkedBooter.java:340)
    at org.apache.maven.surefire.booter.ForkedBooter.execute(ForkedBooter.java:125)
    at org.apache.maven.surefire.booter.ForkedBooter.main(ForkedBooter.java:413)
Caused by: org.springframework.beans.factory.BeanCreationException: Error creating bean with name 'serverEndpointExporter' defined in class path resource [com/winmine/server/config/WebSocketConfig.class]: Invocation of init method failed; nested exception is java.lang.IllegalStateException: javax.websocket.server.ServerContainer not available
    at org.springframework.beans.factory.support.AbstractAutowireCapableBeanFactory.initializeBean(AbstractAutowireCapableBeanFactory.java:1694)
    at org.springframework.beans.factory.support.AbstractAutowireCapableBeanFactory.doCreateBean(AbstractAutowireCapableBeanFactory.java:573)
    at org.springframework.beans.factory.support.AbstractAutowireCapableBeanFactory.createBean(AbstractAutowireCapableBeanFactory.java:495)
    at org.springframework.beans.factory.support.AbstractBeanFactory.lambda$doGetBean$0(AbstractBeanFactory.java:317)
    at org.springframework.beans.factory.support.DefaultSingletonBeanRegistry.getSingleton(DefaultSingletonBeanRegistry.java:222)
    at org.springframework.beans.factory.support.AbstractBeanFactory.doGetBean(AbstractBeanFactory.java:315)
    at org.springframework.beans.factory.support.AbstractBeanFactory.getBean(AbstractBeanFactory.java:199)
    at org.springframework.beans.factory.support.DefaultListableBeanFactory.preInstantiateSingletons(DefaultListableBeanFactory.java:759)
    at org.springframework.context.support.AbstractApplicationContext.finishBeanFactoryInitialization(AbstractApplicationContext.java:867)
    at org.springframework.context.support.AbstractApplicationContext.refresh(AbstractApplicationContext.java:548)
    at org.springframework.boot.SpringApplication.refresh(SpringApplication.java:754)
    at org.springframework.boot.SpringApplication.refreshContext(SpringApplication.java:386)
    at org.springframework.boot.SpringApplication.run(SpringApplication.java:307)
    at org.springframework.boot.test.context.SpringBootContextLoader.loadContext(SpringBootContextLoader.java:127)
    at org.springframework.test.context.cache.DefaultCacheAwareContextLoaderDelegate.loadContextInternal(DefaultCacheAwareContextLoaderDelegate.java:99)
    at org.springframework.test.context.cache.DefaultCacheAwareContextLoaderDelegate.loadContext(DefaultCacheAwareContextLoaderDelegate.java:117)
    ... 27 more
Caused by: java.lang.IllegalStateException: javax.websocket.server.ServerContainer not available
    at org.springframework.util.Assert.state(Assert.java:73)
    at org.springframework.web.socket.server.standard.ServerEndpointExporter.afterPropertiesSet(ServerEndpointExporter.java:107)
    at org.springframework.beans.factory.support.AbstractAutowireCapableBeanFactory.invokeInitMethods(AbstractAutowireCapableBeanFactory.java:1753)
    at org.springframework.beans.factory.support.AbstractAutowireCapableBeanFactory.initializeBean(AbstractAutowireCapableBeanFactory.java:1690)
    ... 42 more
[ERROR] Tests run: 1, Failures: 0, Errors: 1, Skipped: 0, Time elapsed: 4.199 s <<< FAILURE! - in com.example.demo.DemoApplicationTests
[ERROR] getDData(com.example.demo.DemoApplicationTests)  Time elapsed: 0.002 s  <<< ERROR!
java.lang.IllegalStateException: Failed to load ApplicationContext
Caused by: org.springframework.beans.factory.BeanCreationException: Error creating bean with name 'serverEndpointExporter' defined in class path resource [com/winmine/server/config/WebSocketConfig.class]: Invocation of init method failed; nested exception is java.lang.IllegalStateException: javax.websocket.server.ServerContainer not available
Caused by: java.lang.IllegalStateException: javax.websocket.server.ServerContainer not available

[INFO] 
[INFO] Results:
[INFO] 
[ERROR] Errors: 
[ERROR]   DemoApplicationTests.getDData » IllegalState Failed to load ApplicationContext
[INFO] 
[ERROR] Tests run: 1, Failures: 0, Errors: 1, Skipped: 0
[INFO] 
[INFO] ------------------------------------------------------------------------
[INFO] BUILD FAILURE
[INFO] ------------------------------------------------------------------------

View Code

  仔细看报错内容的话,其实已经很明显,比如这几行:

[ERROR] Tests run: 1, Failures: 0, Errors: 1, Skipped: 0, Time elapsed: 4.199 s <<< FAILURE! - in com.example.demo.DemoApplicationTests
[ERROR] getDData(com.example.demo.DemoApplicationTests) Time elapsed: 0.002 s <<< ERROR!
java.lang.IllegalStateException: Failed to load ApplicationContext
Caused by: org.springframework.beans.factory.BeanCreationException: Error creating bean with name 'serverEndpointExporter' defined in class path resource [com/winmine/server/config/WebSocketConfig.class]: Invocation of init method failed; nested exception is java.lang.IllegalStateException: javax.websocket.server.ServerContainer not available
Caused by: java.lang.IllegalStateException: javax.websocket.server.ServerContainer not available

  需要在test类中加

@SpringBootTest(webEnvironment = SpringBootTest.WebEnvironment.RANDOM_PORT) 就可以了,楼主的如下:

springboot整合websocket后打包报错:javax.websocket.server.ServerContainer not available

   问题完美解决。

点赞
收藏
评论区
推荐文章
橘子橙 橘子橙
3年前
vue-element-admin项目打包后,iconfont图标出现乱码
使用vueelementadmin或者vueelementtemplate开发的项目,打包到线上,就出现了图标乱码,f12后能看到icon元素为.eliconclose:before{content:"□"}的情况(如下)
Easter79 Easter79
2年前
springboot整合fastJson遇到重定向问题
通过网上教程使用springboot整合fastJson后遇到页面重定向问题(使用的springboot版本是2.0.2.RELEASE,其他的版本可能不会出现以下问题),如下图:!(https://oscimg.oschina.net/oscnet/5f860c56a7b841bd9e4326b8d0eeb4fd741.png)我的项目结构如
Stella981 Stella981
2年前
SpringBoot整合kafka报could not be established. Broker may not be available.
SpringBoot整合kafka报couldnotbeestablished.Brokermaynotbeavailable.报错日志AdminClientclientIda
Stella981 Stella981
2年前
C# Aspose.Cells导出xlsx格式Excel,打开文件报“Excel 已完成文件级验证和修复。此工作簿的某些部分可能已被修复或丢弃”
报错信息:最近打开下载的Excel,会报如下错误。(xls格式不受影响)!(https://oscimg.oschina.net/oscnet/2b6f0c8d7f97368d095d9f0c96bcb36d410.png)!(https://oscimg.oschina.net/oscnet/fe1a8000d00cec3c
Stella981 Stella981
2年前
Git报错:Permission denied (publickey)
Git在克隆的时候报错、Permissiondenied(publickey).报错Permissiondenied(publickey)具体如下:!(https://oscimg.oschina.net/oscnet/12188ba8b44
Easter79 Easter79
2年前
SpringBoot整合kafka报could not be established. Broker may not be available.
SpringBoot整合kafka报couldnotbeestablished.Brokermaynotbeavailable.报错日志AdminClientclientIda
Stella981 Stella981
2年前
SpringBoot使用assembly进行项目打包教程2
我在前文介绍了如何使用assembly对SpringBoot项目进行打包(点击查看(https://my.oschina.net/piaoxianren/blog/4794382)),打包后会发现项目的代码和项目所有的依赖文件会一起打成一个可执行的jar包。!(https://oscimg.oschina.net/oscnet/up
Stella981 Stella981
2年前
Invalid property 'driver' of bean class [org.apache.commons.dbcp.BasicDataSource]
Spring整合MyBatis!main方法测试,出现异常:!(https://oscimg.oschina.net/oscnet/up5532e35c99469d9cfcd2bec483942cb367e.png)一堆错,很懵逼!别慌,慢慢分析,也许错误很简单;先分析一下applicationContext.xml文件
Easter79 Easter79
2年前
SpringBoot使用assembly进行项目打包教程2
我在前文介绍了如何使用assembly对SpringBoot项目进行打包(点击查看(https://my.oschina.net/piaoxianren/blog/4794382)),打包后会发现项目的代码和项目所有的依赖文件会一起打成一个可执行的jar包。!(https://oscimg.oschina.net/oscnet/up
Stella981 Stella981
2年前
Eclipse 中的Maven常见报错及解决方法
1.不小心将项目中的MavenDependencies删除报错!(https://oscimg.oschina.net/oscnet/fd35e500e2580bca2afb81f35233b87a6ee.png)项目报错:!(https://oscimg.oschina.net/oscnet/8623bd4293fea39ca83a6
Easter79
Easter79
Lv1
今生可爱与温柔,每一样都不能少。
文章
2.8k
粉丝
5
获赞
1.2k